{"text_format":"1","workbook":"xlsx","n_sheets":4,"sheets":["Enquadramento","Reporte","Código Serviço","Entidade pagadora"],"not_rendered":{"charts":0,"images":0,"macros":1,"external_links":1,"defined_names":2,"comments":0,"pivot_tables":0},"unopened":[],"bounds":{"document_bytes":16777216,"sheet_cells":100000,"rows_first":2000,"rows_last":500,"rows_between":2000,"halvings":0,"cell_chars":16384,"cell_head_chars":4096},"cells_cut":0,"cells_raw":0,"read":"whole","date_system":"1900"}

{"sheet":"Enquadramento","index":0,"n_rows":15,"n_cols":1,"rows_kept":15,"cut":false,"hidden":false,"merged":[]}
["Informação de Enquadramento"]
[]
["Início "]
["1. Instrumento Legal"]
["Artigo 66º da  Lei de Enquadramento Orçamental, Lei n.º 151/2015, de 11 de setembro, na sua última redação."]
["2. Universo"]
["Estão obrigadas à prestação desta informação todas as entidades previstas no âmbito do artigo 2.º da Lei de Enquadramento Orçamental, aprovada em anexo à Lei n.º 151/2015, de 11 de setembro, na sua última redação."]
["3. Periodicidade"]
["Anual, devendo a informação ser prestada em 2024, até 1 de abril"]
["4. Elementos a ter em atenção no preenchimento"]
["4.1. A informação a reportar corresponde aos valores recebidos, no ano de 2023, diretamente de Instituições da União Europeia (sem intervenção das agências nacionais de intermediação dos fundos europeus) relativos a projetos financiados por fundos europeus bem como a quaisquer outros valores recebidos a outro título, independentemente do seu registo como receita orçamental ter ou não ocorrido em 2023;"]
["4.2. Todos os serviços englobados no universo acima referido devem proceder à disponibilização desta informação, mesmo que não tenham valores a reportar em nenhuma das situações previstas;"]
["4.3. No caso de não haver dados a reportar, o ficheiro deverá ser submetido a zero;"]
["4.4. Os valores devem estar expressos até ao cêntimo de euro."]
["4.5. Todos os campos do reporte são de preenchimento obrigatório."]

{"sheet":"Reporte","index":1,"n_rows":36,"n_cols":8,"rows_kept":36,"cut":false,"hidden":false,"merged":[[1,2,1,7]]}
[]
[null,null,"Fundos da U.E. diretamente recebidos pelos organismos"]
[]
[null,null,"Código de Serviço/Organismo:","####"]
[null,null,"Ministério: ",{"$f":"IF(ISBLANK($D$4),\"\",VLOOKUP($D$4,'Código Serviço'!$A$2:$D$642,4,FALSE))","v":"n/d"}]
[null,null,"Serviço/Organismo: ",{"$f":"IF(ISBLANK($D$4),\"\",VLOOKUP($D$4,'Código Serviço'!$A$2:$D$642,2,FALSE))","v":"n/d"}]
[null,null,"Número de Identificação Fiscal:",{"$f":"IF(ISBLANK($D$4),\"\",VLOOKUP($D$4,'Código Serviço'!$A$2:$D$642,3,FALSE))","v":"n/d"}]
[null,null,"Ano:",2023]
[]
[]
[null,null,"Designação do Programa (a)","Fundo da UE (b)","Entidade pagadora da UE ( c )","Data do movimento (dd/mm/aaaa)","Montante\n(unidade: €)","Outras Entidades ( c )"]
[]
[]
[]
[]
[]
[]
[]
[]
[]
[]
[]
[]
[]
[]
[]
[]
[]
[]
[]
[]
[]
[null,null,"Instruções:"]
[null,null,"(a) Inclui reembolsos de viagens que devem ser referenciados como tal"]
[null,null,"(b) Se aplicável"]
[null,null,"( c ) Caso a Entidade Pagadora não se encontre na lista, selecione a opção \"Outras Entidades\" e insira a designação da Entidade na coluna \"Outras Entidades\""]

{"sheet":"Código Serviço","index":2,"n_rows":650,"n_cols":4,"rows_kept":650,"cut":false,"hidden":false,"merged":[]}
["Código Serviço","Designação Serviço","NIF","Designação do Ministério"]
["####","n/d","n/d","n/d"]
[1013,"TRIBUNAL DE CONTAS - SEDE","600018709","ENCARGOS GERAIS DO ESTADO"]
[1018,"DESPESAS EXCECIONAIS - DIREÇÃO-GERAL DO TESOURO E FINANÇAS","600006441","FINANÇAS"]
[1030,"ENCARGOS DA DÍVIDA","503756237","FINANÇAS"]
[1033,"CAIXA GERAL DE APOSENTAÇÕES, I.P. - TRANSF. OE","500792968","TRABALHO, SOLIDARIEDADE E SEGURANÇA SOCIAL"]
[1201,"DIREÇÃO-GERAL DA ADMINISTRAÇÃO DA JUSTIÇA","600072525","JUSTIÇA"]
[1203,"SECRETARIA-GERAL DO MINISTÉRIO DA JUSTIÇA","600017613","JUSTIÇA"]
[1205,"CONSELHO SUPERIOR DE MAGISTRATURA - TRANSF. OE","600018466","ENCARGOS GERAIS DO ESTADO"]
[1206,"SUPREMO TRIBUNAL DE JUSTIÇA","600019039","ENCARGOS GERAIS DO ESTADO"]
[1207,"SUPREMO TRIBUNAL ADMINISTRATIVO","600006638","ENCARGOS GERAIS DO ESTADO"]
[1221,"INSTITUTO DOS REGISTOS E DO NOTARIADO, I.P.","508184258","JUSTIÇA"]
[1223,"POLÍCIA JUDICIÁRIA","600011712","JUSTIÇA"]
[1281,"CENTRO DE ESTUDOS JUDICIÁRIOS","501490612","JUSTIÇA"]
[1902,"INSPEÇÃO-GERAL DA EDUCAÇÃO E CIÊNCIA","600084787","EDUCAÇÃO"]
[1906,"INSPEÇÃO-GERAL DAS ATIVIDADES EM SAÚDE","600018857","SAÚDE"]
[1920,"TRIBUNAL DE CONTAS - SECÇÃO REGIONAL DOS AÇORES","672001349","ENCARGOS GERAIS DO ESTADO"]
[1921,"TRIBUNAL DE CONTAS - SECÇÃO REGIONAL DA MADEIRA","671000780","ENCARGOS GERAIS DO ESTADO"]
[1947,"INSPEÇÃO-GERAL DA ADMINISTRAÇÃO INTERNA","600043797","ADMINISTRAÇÃO INTERNA"]
[1950,"SECRETARIA-GERAL DO MINISTÉRIO DA ADMINISTRAÇÃO INTERNA","600014665","ADMINISTRAÇÃO INTERNA"]
[1973,"SERVIÇO DE ESTRANGEIROS E FRONTEIRAS","600015955","ADMINISTRAÇÃO INTERNA"]
[1974,"POLÍCIA DE SEGURANÇA PÚBLICA","600006662","ADMINISTRAÇÃO INTERNA"]
[1975,"GUARDA NACIONAL REPUBLICANA","600008878","ADMINISTRAÇÃO INTERNA"]
[1978,"SECRETARIA-GERAL DO MTSSS","600081966","TRABALHO, SOLIDARIEDADE E SEGURANÇA SOCIAL"]
[2145,"LABORATÓRIO NACIONAL DE ENGENHARIA CIVIL - TRANSF. OE","501389660","INFRAESTRUTURAS"]
[2164,"ACADEMIA DAS CIÊNCIAS DE LISBOA","501749799","CIENCIA, TECNOLOGIA E ENSINO SUPERIOR"]
[2168,"CENTRO CIENTÍFICO E CULTURAL DE MACAU, I.P.","503494313","CIENCIA, TECNOLOGIA E ENSINO SUPERIOR"]
[2185,"COMISSÃO DE COORDENAÇÃO E DESENVOLVIMENTO REGIONAL DO NORTE - TRANSF. OE","600074404","COESAO TERRITORIAL"]
[2186,"COMISSÃO DE COORDENAÇÃO E DESENVOLVIMENTO REGIONAL DO CENTRO - TRANSF. OE","600075613","COESAO TERRITORIAL"]
[2187,"COMISSÃO DE COORDENAÇÃO E DESENV. REGIONAL DE LISBOA E VALE DO TEJO - TRANSF OE","600076849","COESAO TERRITORIAL"]
[2188,"COMISSÃO DE COORDENAÇÃO E DESENVOLVIMENTO REGIONAL DO ALENTEJO - TRANSF. OE","600075826","COESAO TERRITORIAL"]
[2189,"COMISSÃO DE COORDENAÇÃO E DESENVOLVIMENTO REGIONAL DO ALGARVE - TRANSF. OE","517638827","COESAO TERRITORIAL"]
[2190,"INSTITUTO NACIONAL DE ESTATÍSTICA, I.P.","502237490","PRESIDÊNCIA DO CONSELHO DE MINISTROS"]
[2194,"DIREÇÃO-GERAL DA SAÚDE","600037100","SAÚDE"]
[2207,"ESCOLA SUPERIOR DE HOTELARIA E TURISMO DO ESTORIL - TRANSF. OE","502701676","CIENCIA, TECNOLOGIA E ENSINO SUPERIOR"]
[2233,"DIREÇÃO-GERAL DA SEGURANÇA SOCIAL","600080242","TRABALHO, SOLIDARIEDADE E SEGURANÇA SOCIAL"]
[2236,"INSTITUTO NACIONAL PARA REABILITAÇÃO, IP","600055930","TRABALHO, SOLIDARIEDADE E SEGURANÇA SOCIAL"]
[2244,"ESCOLA SUPERIOR NÁUTICA INFANTE D. HENRIQUE - TRANSF. OE","508820111","CIENCIA, TECNOLOGIA E ENSINO SUPERIOR"]
[2266,"LABORATÓRIO NACIONAL DE ENERGIA E GEOLOGIA, I.P. - TRANSF. OE","508424780","AMBIENTE E DA AÇÃO CLIMÁTICA"]
[2286,"DIREÇÃO REGIONAL DE CULTURA DO NORTE","600067831","CULTURA"]
[2287,"DIREÇÃO REGIONAL DE CULTURA DO CENTRO","600025314","CULTURA"]
[2288,"DIREÇÃO REGIONAL DE CULTURA DO ALENTEJO","600031985","CULTURA"]
[2289,"DIREÇÃO REGIONAL DE CULTURA DO ALGARVE","600083012","CULTURA"]
[2313,"PRESIDÊNCIA DA REPÚBLICA - TRANSF. OE","600000869","ENCARGOS GERAIS DO ESTADO"]
[2314,"ASSEMBLEIA DA REPÚBLICA - TRANSF. OE","600054128","ENCARGOS GERAIS DO ESTADO"]
[2334,"CONSELHO ECONÓMICO E SOCIAL","600034380","ENCARGOS GERAIS DO ESTADO"]
[2335,"GABINETE DO REPRESENTANTE DA REPÚBLICA - REGIÃO AUTÓNOMA DA MADEIRA","671000535","ENCARGOS GERAIS DO ESTADO"]
[2336,"GABINETE DO REPRESENTANTE DA REPÚBLICA - REGIÃO AUTÓNOMA DOS AÇORES","672000652","ENCARGOS GERAIS DO ESTADO"]
[2342,"GABINETE DE MEMBROS DO GOVERNO - MDN","600014380","DEFESA NACIONAL"]
[2343,"SECRETARIA-GERAL DO MINISTÉRIO DA DEFESA NACIONAL","600032205","DEFESA NACIONAL"]
[2344,"DIREÇÃO-GERAL DE POLÍTICA DE DEFESA NACIONAL","600065790","DEFESA NACIONAL"]
[2349,"INSPEÇÃO-GERAL DE DEFESA NACIONAL","600065596","DEFESA NACIONAL"]
[2350,"INSTITUTO DE DEFESA NACIONAL","600014002","DEFESA NACIONAL"]
[2351,"POLÍCIA JUDICIÁRIA MILITAR","600017664","DEFESA NACIONAL"]
[2402,"DIREÇÃO REGIONAL DE AGRICULTURA E PESCAS DE LISBOA E VALE DO TEJO","600005305","AGRICULTURA E ALIMENTAÇÃO"]
[2403,"DIREÇÃO REGIONAL DE AGRICULTURA E PESCAS DO ALENTEJO","680011439","AGRICULTURA E ALIMENTAÇÃO"]
[2404,"DIREÇÃO REGIONAL DE AGRICULTURA E PESCAS DO ALGARVE","600005291","AGRICULTURA E ALIMENTAÇÃO"]
[2410,"DIREÇÃO-GERAL DE ALIMENTAÇÃO E VETERINÁRIA","600045234","AGRICULTURA E ALIMENTAÇÃO"]
[2420,"FUNDAÇÃO PARA A CIÊNCIA E TECNOLOGIA, I.P. - TRANSF. OE","503904040","CIENCIA, TECNOLOGIA E ENSINO SUPERIOR"]
[2443,"CONSELHO NACIONAL DO AMBIENTE E DESENVOLVIMENTO SUSTENTÁVEL","600079015","AMBIENTE E DA AÇÃO CLIMÁTICA"]
[2450,"CONSELHO NACIONAL DA ÁGUA","600079260","AMBIENTE E DA AÇÃO CLIMÁTICA"]
[2479,"TRANSFERÊNCIAS PARA A ADMINISTRAÇÃO LOCAL","600035972","ENCARGOS GERAIS DO ESTADO"]
[2528,"INSPEÇÃO-GERAL DO MTSSS","600061329","TRABALHO, SOLIDARIEDADE E SEGURANÇA SOCIAL"]
[2530,"DIREÇÃO-GERAL DA ADMINISTRAÇÃO ESCOLAR","600084817","EDUCAÇÃO"]
[2538,"COMISSÃO PARA A IGUALDADE NO TRABALHO E EMPREGO","600087450","TRABALHO, SOLIDARIEDADE E SEGURANÇA SOCIAL"]
[2550,"INSPEÇÃO-GERAL DOS SERVIÇOS DE JUSTIÇA","600070077","JUSTIÇA"]
[2561,"DIREÇÃO-GERAL DO ENSINO SUPERIOR","600061388","CIENCIA, TECNOLOGIA E ENSINO SUPERIOR"]
[2611,"DIREÇÃO-GERAL DO EMPREGO E DAS RELAÇÕES DE TRABALHO","600073270","TRABALHO, SOLIDARIEDADE E SEGURANÇA SOCIAL"]
[2617,"ESCOLA PORTUGUESA DE MOÇAMBIQUE - TRANSF. OE","600063500","EDUCAÇÃO"]
[2618,"SECRETARIA-GERAL DO MINISTÉRIO DA EDUCAÇÃO","600015467","EDUCAÇÃO"]
[2625,"CONSELHO NACIONAL DE EDUCAÇÃO","600027457","EDUCAÇÃO"]
[2641,"DIREÇÃO-GERAL DA EDUCAÇÃO","600084809","EDUCAÇÃO"]
[2654,"TRIBUNAL DA RELAÇÃO DE LISBOA","600006883","JUSTIÇA"]
[2655,"TRIBUNAL DA RELAÇÃO DO PORTO","600014010","JUSTIÇA"]
[2656,"TRIBUNAL DA RELAÇÃO DE COIMBRA","600008690","JUSTIÇA"]
[2657,"TRIBUNAL DA RELAÇÃO DE ÉVORA","600009092","JUSTIÇA"]
[2658,"TRIBUNAL DA RELAÇÃO DE GUIMARÃES","600071235","JUSTIÇA"]
[2659,"TRIBUNAL CENTRAL ADMINISTRATIVO - SUL","600053970","JUSTIÇA"]
[2666,"DOTAÇÃO PROVISIONAL","600015300","FINANÇAS"]
[2706,"FUNDO DE FOMENTO CULTURAL - TRANSF. OE","600015548","CULTURA"]
[2710,"ADMINISTRAÇÃO CENTRAL DO SISTEMA DE SAÚDE, I.P. - TRANSF. OE","508188423","SAÚDE"]
[2752,"INSTITUTO DE AÇÃO SOCIAL DAS FORÇAS ARMADAS - TRANSF. OE","500746427","DEFESA NACIONAL"]
[2780,"IAPMEI - AGÊNCIA PARA A COMPETITIVIDADE E INOVAÇÃO, I.P. - TRANSF. OE","501373357","ECONOMIA E MAR"]
[2790,"ESTADO-MAIOR-GENERAL DAS FORÇAS ARMADAS","600010180","DEFESA NACIONAL"]
[2791,"MARINHA","600012662","DEFESA NACIONAL"]
[2792,"EXÉRCITO","600021610","DEFESA NACIONAL"]
[2793,"FORÇA AÉREA","600010686","DEFESA NACIONAL"]
[2804,"TRIBUNAL CENTRAL ADMINISTRATIVO - NORTE","600077390","JUSTIÇA"]
[2852,"INSTITUTO HIDROGRÁFICO - TRANSF. OE","501494170","DEFESA NACIONAL"]
[2892,"SERVIÇO DE INFORMAÇÕES ESTRATÉGICAS DE DEFESA - TRANSF. OE","600053903","PRESIDÊNCIA DO CONSELHO DE MINISTROS"]
[2893,"SERVIÇO DE INFORMAÇÕES DE SEGURANÇA - TRANSF. OE","600023168","PRESIDÊNCIA DO CONSELHO DE MINISTROS"]
[2897,"SECRETARIA-GERAL DO MINISTÉRIO DA SAÚDE","600080684","SAÚDE"]
[2932,"DIREÇÃO-GERAL DA POLÍTICA DE JUSTIÇA","600082571","JUSTIÇA"]
[2938,"GABINETE DE ESTRATÉGIA E PLANEAMENTO","600082717","TRABALHO, SOLIDARIEDADE E SEGURANÇA SOCIAL"]
[2939,"INSTITUTO DE FINANCIAMENTO DA AGRICULTURA E PESCAS, I.P. - TRANSF. OE","508136644","AGRICULTURA E ALIMENTAÇÃO"]
[2940,"DIREÇÃO-GERAL DA AGRICULTURA E DESENVOLVIMENTO RURAL","600082440","AGRICULTURA E ALIMENTAÇÃO"]
[2941,"DIREÇÃO-GERAL DE ESTATÍSTICAS DA EDUCAÇÃO E CIÊNCIA","600084906","EDUCAÇÃO"]
[2942,"AGÊNCIA NACIONAL PARA A QUALIFICAÇÃO E O ENSINO PROFISSIONAL, I.P.- TRANSF. OE","510265006","EDUCAÇÃO"]
[2944,"DIREÇÃO REGIONAL DE AGRICULTURA E PESCAS DO NORTE","600000354","AGRICULTURA E ALIMENTAÇÃO"]
[2946,"AUTORIDADE NACIONAL DE EMERGÊNCIA E PROTEÇÃO CIVIL - TRANSF. OE","600082490","ADMINISTRAÇÃO INTERNA"]
[2947,"AUTORIDADE NACIONAL DE SEGURANÇA RODOVIÁRIA","600082563","ADMINISTRAÇÃO INTERNA"]
[2949,"DIREÇÃO REGIONAL DE AGRICULTURA E PESCAS DO CENTRO","600082466","AGRICULTURA E ALIMENTAÇÃO"]
[2961,"GABINETE DE PLANEAMENTO E POLÍTICAS","600082458","AGRICULTURA E ALIMENTAÇÃO"]
[2962,"SERVIÇOS SOCIAIS DA ADMINISTRAÇÃO PÚBLICA  - TRANSF OE","600082628","PRESIDÊNCIA DO CONSELHO DE MINISTROS"]
[2963,"AGÊNCIA PARA A MODERNIZAÇÃO ADMINISTRATIVA, I.P. - TRANSF. OE","508184509","PRESIDÊNCIA DO CONSELHO DE MINISTROS"]
[2965,"AUTORIDADE PARA AS CONDIÇÕES DE TRABALHO","600083349","TRABALHO, SOLIDARIEDADE E SEGURANÇA SOCIAL"]
[2973,"UNIVERSIDADE ABERTA - TRANSF.OE","502110660","CIENCIA, TECNOLOGIA E ENSINO SUPERIOR"]
[2974,"UNIVERSIDADE DOS AÇORES - TRANSF. OE","512017050","CIENCIA, TECNOLOGIA E ENSINO SUPERIOR"]
[2975,"UNIVERSIDADE DO ALGARVE - TRANSF. OE","505387271","CIENCIA, TECNOLOGIA E ENSINO SUPERIOR"]
[2976,"UNIVERSIDADE DE AVEIRO - FUNDAÇÃO PÚBLICA - TRANSF. OE","501461108","CIENCIA, TECNOLOGIA E ENSINO SUPERIOR"]
[2977,"UNIVERSIDADE DA BEIRA INTERIOR - TRANSF. OE","502083514","CIENCIA, TECNOLOGIA E ENSINO SUPERIOR"]
[2978,"UNIVERSIDADE DE COIMBRA - TRANSF. OE","501617582","CIENCIA, TECNOLOGIA E ENSINO SUPERIOR"]
[2979,"UNIVERSIDADE DE ÉVORA - TRANSF. OE","501201920","CIENCIA, TECNOLOGIA E ENSINO SUPERIOR"]
[2981,"UNIVERSIDADE DA MADEIRA - TRANSF. OE","680041982","CIENCIA, TECNOLOGIA E ENSINO SUPERIOR"]
[2982,"UNIVERSIDADE DO MINHO - FUNDAÇÃO PÚBLICA -  TRANSF. OE","502011378","CIENCIA, TECNOLOGIA E ENSINO SUPERIOR"]
[2984,"UNIVERSIDADE DO PORTO - FUNDAÇÃO PÚBLICA - TRANSF. OE","501413197","CIENCIA, TECNOLOGIA E ENSINO SUPERIOR"]
[2986,"UNIVERSIDADE DE TRÁS-OS-MONTES E ALTO DOURO - TRANSF. OE","501345361","CIENCIA, TECNOLOGIA E ENSINO SUPERIOR"]
[2987,"ISCTE - INSTITUTO UNIVERSITÁRIO DE LISBOA - FUNDAÇÃO PÚBLICA - TRANSF. OE","501510184","CIENCIA, TECNOLOGIA E ENSINO SUPERIOR"]
[2988,"INSTITUTO POLITÉCNICO DE BEJA - TRANSF. OE","680038671","CIENCIA, TECNOLOGIA E ENSINO SUPERIOR"]
[2989,"INSTITUTO POLITÉCNICO DE BRAGANÇA - TRANSF. OE","600013758","CIENCIA, TECNOLOGIA E ENSINO SUPERIOR"]
[2990,"INSTITUTO POLITÉCNICO DE CASTELO BRANCO - TRANSF. OE","504152980","CIENCIA, TECNOLOGIA E ENSINO SUPERIOR"]
[2991,"INSTITUTO POLITÉCNICO DO CÁVADO E DO AVE - FUNDAÇÃO PÚBLICA - TRANSF. OE","503494933","CIENCIA, TECNOLOGIA E ENSINO SUPERIOR"]
[2992,"INSTITUTO POLITÉCNICO DE COIMBRA - TRANSF. OE","600027350","CIENCIA, TECNOLOGIA E ENSINO SUPERIOR"]
[2993,"INSTITUTO POLITÉCNICO DA GUARDA - TRANSF. OE","600023265","CIENCIA, TECNOLOGIA E ENSINO SUPERIOR"]
[2994,"INSTITUTO POLITÉCNICO DE LEIRIA - TRANSF. OE","506971244","CIENCIA, TECNOLOGIA E ENSINO SUPERIOR"]
[2995,"INSTITUTO POLITÉCNICO DE LISBOA - TRANSF. OE","508519713","CIENCIA, TECNOLOGIA E ENSINO SUPERIOR"]
[2996,"INSTITUTO POLITÉCNICO DE PORTALEGRE - TRANSF. OE","600028348","CIENCIA, TECNOLOGIA E ENSINO SUPERIOR"]
[2997,"INSTITUTO POLITÉCNICO DO PORTO - TRANSF. OE","503606251","CIENCIA, TECNOLOGIA E ENSINO SUPERIOR"]
[2998,"INSTITUTO POLITÉCNICO DE SANTARÉM - TRANSF. OE","501403906","CIENCIA, TECNOLOGIA E ENSINO SUPERIOR"]
[2999,"INSTITUTO POLITÉCNICO DE SETÚBAL - TRANSF. OE","503720364","CIENCIA, TECNOLOGIA E ENSINO SUPERIOR"]
[3000,"INSTITUTO POLITÉCNICO DE TOMAR - TRANSF. OE","503767549","CIENCIA, TECNOLOGIA E ENSINO SUPERIOR"]
[3001,"INSTITUTO POLITÉCNICO DE VIANA DO CASTELO - TRANSF. OE","503761877","CIENCIA, TECNOLOGIA E ENSINO SUPERIOR"]
[3002,"INSTITUTO POLITÉCNICO DE VISEU - TRANSF. OE","680033548","CIENCIA, TECNOLOGIA E ENSINO SUPERIOR"]
[3003,"ESCOLA SUPERIOR DE ENFERMAGEM DE COIMBRA - TRANSF. OE","600081583","CIENCIA, TECNOLOGIA E ENSINO SUPERIOR"]
[3004,"ESCOLA SUPERIOR DE ENFERMAGEM DO PORTO - TRANSF. OE","507880803","CIENCIA, TECNOLOGIA E ENSINO SUPERIOR"]
[3005,"ESCOLA SUPERIOR DE ENFERMAGEM DE LISBOA - TRANSF. OE","508310350","CIENCIA, TECNOLOGIA E ENSINO SUPERIOR"]
[3011,"GABINETE DO SECRETÁRIO-GERAL ESTRUTURAS COMUNS AO SIED E SIS - TRANSF. OE","600083250","PRESIDÊNCIA DO CONSELHO DE MINISTROS"]
[3014,"CONSELHO DE PREVENÇÃO DA CORRUPÇÃO","600083616","ENCARGOS GERAIS DO ESTADO"]
[3035,"ESCOLA PORTUGUESA DE DÍLI - CELP - RUY CINATTI - TRANSF. OE","600084035","EDUCAÇÃO"]
[3043,"COMISSÃO NACIONAL DE ELEIÇÕES","600030865","ENCARGOS GERAIS DO ESTADO"]
[3044,"COMISSÃO DE ACESSO AOS DOCUMENTOS ADMINISTRATIVOS","503268011","ENCARGOS GERAIS DO ESTADO"]
[3046,"CONSELHO NACIONAL DE ÉTICA PARA AS CIÊNCIAS DA VIDA","600083837","ENCARGOS GERAIS DO ESTADO"]
[3047,"COMISSÃO DE PROTEÇÃO DE VÍTIMAS DE CRIMES","600084418","JUSTIÇA"]
[3048,"ESTRUTURA DE MISSÃO PARA A EXTENSÃO DA PLATAFORMA CONTINENTAL","600081028","ECONOMIA E MAR"]
[3051,"SAS - UNIVERSIDADE DOS AÇORES - TRANSF. OE","672001926","CIENCIA, TECNOLOGIA E ENSINO SUPERIOR"]
[3052,"SAS - UNIVERSIDADE DO ALGARVE - TRANSF. OE","600039510","CIENCIA, TECNOLOGIA E ENSINO SUPERIOR"]
[3053,"SAS - UNIVERSIDADE DA BEIRA INTERIOR - TRANSF. OE","600017982","CIENCIA, TECNOLOGIA E ENSINO SUPERIOR"]
[3054,"SAS - UNIVERSIDADE DE COIMBRA - TRANSF. OE","600038106","CIENCIA, TECNOLOGIA E ENSINO SUPERIOR"]
[3055,"SAS - UNIVERSIDADE DE ÉVORA - TRANSF. OE","600038009","CIENCIA, TECNOLOGIA E ENSINO SUPERIOR"]
[3056,"UL - FACULDADE DE MEDICINA - TRANSF. OE","502662875","CIENCIA, TECNOLOGIA E ENSINO SUPERIOR"]
[3057,"UL - FACULDADE DE CIÊNCIAS - TRANSF. OE","502618418","CIENCIA, TECNOLOGIA E ENSINO SUPERIOR"]
[3058,"UL - FACULDADE DE LETRAS - TRANSF. OE","502657456","CIENCIA, TECNOLOGIA E ENSINO SUPERIOR"]
[3059,"UL - FACULDADE DE DIREITO - TRANSF. OE","502736208","CIENCIA, TECNOLOGIA E ENSINO SUPERIOR"]
[3060,"UL - FACULDADE DE FARMÁCIA - TRANSF. OE","502659807","CIENCIA, TECNOLOGIA E ENSINO SUPERIOR"]
[3061,"UL - INSTITUTO DE CIÊNCIAS SOCIAIS - TRANSF. OE","506101347","CIENCIA, TECNOLOGIA E ENSINO SUPERIOR"]
[3062,"UL - FACULDADE DE BELAS-ARTES - TRANSF. OE","504035541","CIENCIA, TECNOLOGIA E ENSINO SUPERIOR"]
[3063,"UL - FACULDADE DE MEDICINA DENTÁRIA - TRANSF. OE","503013366","CIENCIA, TECNOLOGIA E ENSINO SUPERIOR"]
[3064,"UL - FACULDADE DE PSICOLOGIA - TRANSF. OE","600083861","CIENCIA, TECNOLOGIA E ENSINO SUPERIOR"]
[3065,"UL - INSTITUTO DE EDUCAÇÃO - TRANSF. OE","600083853","CIENCIA, TECNOLOGIA E ENSINO SUPERIOR"]
[3066,"UL - INSTITUTO DE GEOGRAFIA E ORDENAMENTO DO TERRITÓRIO - TRANSF. OE","508955645","CIENCIA, TECNOLOGIA E ENSINO SUPERIOR"]
[3069,"SAS - UNIVERSIDADE DA MADEIRA - TRANSF. OE","671001116","CIENCIA, TECNOLOGIA E ENSINO SUPERIOR"]
[3070,"SAS - UNIVERSIDADE DO MINHO - TRANSF. OE","680047360","CIENCIA, TECNOLOGIA E ENSINO SUPERIOR"]
[3081,"UL - INSTITUTO SUPERIOR TÉCNICO - TRANSF. OE","501507930","CIENCIA, TECNOLOGIA E ENSINO SUPERIOR"]
[3082,"UL - INSTITUTO SUPERIOR DE ECONOMIA E GESTÃO - TRANSF. OE","502488603","CIENCIA, TECNOLOGIA E ENSINO SUPERIOR"]
[3083,"UL - INSTITUTO SUPERIOR DE AGRONOMIA - TRANSF. OE","505869721","CIENCIA, TECNOLOGIA E ENSINO SUPERIOR"]
[3084,"UL - FACULDADE DE MEDICINA VETERINÁRIA - TRANSF. OE","502286326","CIENCIA, TECNOLOGIA E ENSINO SUPERIOR"]
[3085,"UL - INSTITUTO SUPERIOR DE CIÊNCIAS SOCIAIS E POLÍTICAS - TRANSF. OE","600019152","CIENCIA, TECNOLOGIA E ENSINO SUPERIOR"]
[3086,"UL - FACULDADE DE ARQUITETURA - TRANSF. OE","502784083","CIENCIA, TECNOLOGIA E ENSINO SUPERIOR"]
[3087,"UL - FACULDADE DE MOTRICIDADE HUMANA - TRANSF. OE","501621288","CIENCIA, TECNOLOGIA E ENSINO SUPERIOR"]
[3089,"SAS - UNIVERSIDADE DE TRÁS-OS-MONTES E ALTO DOURO - TRANSF. OE","600039366","CIENCIA, TECNOLOGIA E ENSINO SUPERIOR"]
[3090,"SAS - INSTITUTO POLITÉCNICO DE BEJA - TRANSF. OE","600040925","CIENCIA, TECNOLOGIA E ENSINO SUPERIOR"]
[3091,"SAS - INSTITUTO POLITÉCNICO DE BRAGANÇA - TRANSF. OE","600041611","CIENCIA, TECNOLOGIA E ENSINO SUPERIOR"]
[3092,"SAS - INSTITUTO POLITÉCNICO DE CASTELO BRANCO - TRANSF. OE","600044068","CIENCIA, TECNOLOGIA E ENSINO SUPERIOR"]
[3094,"SAS - INSTITUTO POLITÉCNICO DE COIMBRA - TRANSF. OE","600052737","CIENCIA, TECNOLOGIA E ENSINO SUPERIOR"]
[3095,"SAS - INSTITUTO POLITÉCNICO DA GUARDA - TRANSF. OE","600043010","CIENCIA, TECNOLOGIA E ENSINO SUPERIOR"]
[3096,"SAS - INSTITUTO POLITÉCNICO DE LEIRIA - TRANSF. OE","600041581","CIENCIA, TECNOLOGIA E ENSINO SUPERIOR"]
[3097,"INSTITUTO SUPERIOR DE ENGENHARIA DE LISBOA - TRANSF. OE","600016234","CIENCIA, TECNOLOGIA E ENSINO SUPERIOR"]
[3098,"SAS - INSTITUTO POLITÉCNICO DE LISBOA - TRANSF. OE","600037274","CIENCIA, TECNOLOGIA E ENSINO SUPERIOR"]
[3099,"SAS - INSTITUTO POLITÉCNICO DE PORTALEGRE - TRANSF. OE","600058832","CIENCIA, TECNOLOGIA E ENSINO SUPERIOR"]
[3100,"INSTITUTO SUPERIOR DE ENGENHARIA DO PORTO - TRANSF. OE","501540709","CIENCIA, TECNOLOGIA E ENSINO SUPERIOR"]
[3101,"SAS - INSTITUTO POLITÉCNICO DO PORTO - TRANSF. OE","600054110","CIENCIA, TECNOLOGIA E ENSINO SUPERIOR"]
[3102,"SAS - INSTITUTO POLITÉCNICO DE SANTARÉM - TRANSF. OE","600043045","CIENCIA, TECNOLOGIA E ENSINO SUPERIOR"]
[3103,"SAS - INSTITUTO POLITÉCNICO DE SETÚBAL - TRANSF. OE","600083845","CIENCIA, TECNOLOGIA E ENSINO SUPERIOR"]
[3104,"SAS - INSTITUTO POLITÉCNICO DE TOMAR - TRANSF. OE","600052338","CIENCIA, TECNOLOGIA E ENSINO SUPERIOR"]
[3105,"SAS - INSTITUTO POLITÉCNICO DE VIANA DO CASTELO - TRANSF. OE","600041212","CIENCIA, TECNOLOGIA E ENSINO SUPERIOR"]
[3106,"SAS - INSTITUTO POLITÉCNICO DE VISEU - TRANSF.OE","600044742","CIENCIA, TECNOLOGIA E ENSINO SUPERIOR"]
[3108,"INSTITUTO NACIONAL DE SAÚDE DR. RICARDO JORGE, I.P.- TRANSF. OE","501427511","SAÚDE"]
[3112,"INSTITUTO DE OFTALMOLOGIA DR. GAMA PINTO - TRANSF. OE","600000052","SAÚDE"]
[3113,"ADMINISTRAÇÃO REGIONAL DE SAÚDE DO NORTE - TRANSF. OE","503135593","SAÚDE"]
[3114,"ADMINISTRAÇÃO REGIONAL DE SAÚDE DO CENTRO - TRANSF. OE","503122165","SAÚDE"]
[3115,"ADMINISTRAÇÃO REGIONAL SAÚDE DE LISBOA E VALE TEJO-TRANSF. OE","503148776","SAÚDE"]
[3116,"ADMINISTRAÇÃO REGIONAL DE SAÚDE DO ALENTEJO - TRANSF. OE","503148768","SAÚDE"]
[3117,"ADMINISTRAÇÃO REGIONAL DE SAÚDE DO ALGARVE - TRANSF. OE","503148709","SAÚDE"]
[3118,"CENTRO MÉDICO REABILITAÇÃO DA REGIÃO CENTRO ROVISCO PAIS-TRANSF.OE","503767336","SAÚDE"]
[3126,"HOSPITAL ARCEBISPO JOÃO CRISÓSTOMO - CANTANHEDE - TRANSF. OE","501626123","SAÚDE"]
[3127,"HOSPITAL DR. FRANCISCO ZAGALO - OVAR - TRANSF. OE","501510150","SAÚDE"]
[3128,"CENTRO HOSPITALAR PSIQUIÁTRICO DE LISBOA - TRANSF. OE","508338476","SAÚDE"]
[3130,"AUTORIDADE TRIBUTÁRIA E ADUANEIRA","600084779","FINANÇAS"]
[3131,"INSTITUTO PORTUGUÊS DO DESPORTO E JUVENTUDE, IP - TRANSF. OE","510089224","PRESIDÊNCIA DO CONSELHO DE MINISTROS"]
[4198,"CONSELHO DAS FINANÇAS PÚBLICAS - TRANSF. OE","510156215","ENCARGOS GERAIS DO ESTADO"]
{"$rows_left_out":451}
{"sheet":"Entidade pagadora","index":3,"n_rows":50,"n_cols":1,"rows_kept":50,"cut":false,"hidden":false,"merged":[]}
["Agência da União Europeia de Cooperação dos Reguladores da Energia (ACER)"]
["Agência da União Europeia para a Cibersegurança (ENISA)"]
["Agência da União Europeia para a Cooperação Judiciária Penal (Eurojust)"]
["Agência da União Europeia para a Cooperação Policial (Europol)"]
["Agência da União Europeia para a Formação Policial (CEPOL)"]
["Agência da União Europeia para a Gestão Operacional de Sistemas Informáticos de Grande Escala no Espaço de Liberdade, Segurança e Justiça (eu-LISA)"]
["Agência da União Europeia para a Segurança da Aviação (AESA)"]
["Agência da União Europeia para o Programa Espacial (EUSPA)"]
["Agência de Apoio ao Organismo de Reguladores Europeus das Comunicações Eletrónicas (Gabinete do ORECE)"]
["Agência de Aprovisionamento da Euratom (AAE)"]
["Agência de Defesa Europeia (EDA)"]
["Agência de Execução do Conselho Europeu da Inovação e das PME (EISMEA)"]
["Agência de Execução do Conselho Europeu de Investigação (ERCEA)"]
["Agência de Execução Europeia da Saúde e do Digital (HADEA)"]
["Agência de Execução Europeia do Clima, das Infraestruturas e do Ambiente (CINEA)"]
["Agência de Execução relativa à Educação, ao Audiovisual e à Cultura (EACEA)"]
["Agência do GNSS europeu (GSA)"]
["Agência dos Direitos Fundamentais da União Europeia (FRA)"]
["Agência Europeia da Guarda de Fronteiras e Costeira (Frontex)"]
["Agência Europeia da Segurança Marítima (EMSA)"]
["Agência Europeia de Controlo das Pescas (AECP)"]
["Agência Europeia de Execução para a Investigação (EREA)"]
["Agência Europeia de Medicamentos (EMA)"]
["Agência Europeia do Ambiente (EEA)"]
["Agência Europeia dos Produtos Químicos (ECHA)"]
["Agência Europeia para a Segurança e a Saúde no Trabalho (EU-OSHA)"]
["Agência Ferroviária da União Europeia (ERA)"]
["Autoridade Bancária Europeia (EBA)"]
["Autoridade Europeia do Trabalho (ELA)"]
["Autoridade Europeia dos Seguros e Pensões Complementares de Reforma (EIOPA)"]
["Autoridade Europeia dos Valores Mobiliários e dos Mercados (ESMA)"]
["Autoridade Europeia para a Segurança dos Alimentos (EFSA)"]
["Centro de Tradução dos Organismos da União Europeia (CdT)"]
["Centro Europeu de Prevenção e Controlo das Doenças (ECDC)"]
["Centro Europeu para o Desenvolvimento da Formação Profissional (Cedefop)"]
["Comissão Europeia"]
["Conselho Europeu"]
["Conselho Único de Resolução (SRB)"]
["Euratom"]
["Eurostat"]
["Fundação Europeia para a Formação (EFT)"]
["Fundação Europeia para a Melhoria das Condições de Vida e de Trabalho (Eurofound)"]
["Gabinete Europeu de Apoio em matéria de Asilo (EUAA)"]
["Instituto Comunitário das Variedades Vegetais (ICVV)"]
["Instituto da Propriedade Intelectual da União Europeia (EUIPO)"]
["Instituto Europeu de Inovação e Tecnologia (EIT)"]
["Instituto Europeu para a Igualdade de Género (EIGE)"]
["Observatório Europeu da Droga e da Toxicodependência (EMCDDA)"]
["Outras Entidades"]
["Procuradoria Europeia (EPPO)"]